Reaction Details
TargetCoagulation factor IX
LigandBDBM241503
Substrate/CompetitorUS9409908, pyroGlu-Pro-Arg-pNA
Meas. Tech.In Vitro Assay
pH7.4±n/a
Ki 0.05±n/a nM
Commentsextracted
Citation Yang, WCorte, JRGilligan, PJPinto, DJEwing, WRDilger, AKWang, YFang, TPabbisetty, KBSmith, II, LM Dihydropyridone p1 as factor XIa inhibitors US Patent US9409908 Publication Date 8/9/2016
 
Coagulation factor IX
Name:Coagulation factor IX
Type:Enzyme
Mol. Mass.:51768.83
Organism:Homo sapiens (Human)
Description:P00740
Residue:461
BDBM241503
US9409908, pyroGlu-Pro-Arg-pNA
NameBDBM241503
Synonyms:US9409908, 135 | US9951071, Example 135
TypeSmall organic molecule
Emp. Form.C29H27Cl2F2N5O4
Mol. Mass.618.459
SMILESCOC(=O)Nc1ccc2-c3nc([nH]c3Cl)[C@H](CCC[C@@H](C)C(=O)Nc2c1)N1CCC(=CC1=O)c1c(F)ccc(Cl)c1F