Reaction Details
TargetCoagulation factor IX
LigandBDBM241519
Substrate/CompetitorUS9409908, pyroGlu-Pro-Arg-pNA
Meas. Tech.In Vitro Assay
pH7.4±n/a
Ki 0.84±n/a nM
Commentsextracted
Citation Yang, WCorte, JRGilligan, PJPinto, DJEwing, WRDilger, AKWang, YFang, TPabbisetty, KBSmith, II, LM Dihydropyridone p1 as factor XIa inhibitors US Patent US9409908 Publication Date 8/9/2016
 
Coagulation factor IX
Name:Coagulation factor IX
Type:Enzyme
Mol. Mass.:51768.83
Organism:Homo sapiens (Human)
Description:P00740
Residue:461
BDBM241519
US9409908, pyroGlu-Pro-Arg-pNA
NameBDBM241519
Synonyms:US9409908, 151 | US9951071, Example 151
TypeSmall organic molecule
Emp. Form.C30H31ClFN5O4
Mol. Mass.580.05
SMILESCOC(=O)Nc1ccc2-c3nc([nH]c3C)[C@H](CCC[C@@H](C)C(=O)Nc2c1)N1CCC(=CC1=O)c1cccc(Cl)c1F