Reaction Details
TargetPlasma kallikrein
LigandBDBM241370
Substrate/CompetitorBDBM241595
Meas. Tech.In Vitro Assay
Temperature298.15±n/a K
Ki 5±n/a nM
Citation Yang, WCorte, JRGilligan, PJPinto, DJEwing, WRDilger, AKWang, YFang, TPabbisetty, KBSmith, II, LM Dihydropyridone p1 as factor XIa inhibitors US Patent US9409908 Publication Date 8/9/2016
 
Plasma kallikrein
Name:Plasma kallikrein
Type:Protein
Mol. Mass.:71391.16
Organism:Homo sapiens (Human)
Description:P03952
Residue:638
BDBM241370
BDBM241595
NameBDBM241370
Synonyms:US9409908, 2 | US9951071, Example 2
TypeSmall organic molecule
Emp. Form.C32H32ClFN4O4
Mol. Mass.591.072
SMILESCOC(=O)Nc1ccc-2c(NC(=O)[C@H](C)CCC[C@H](N3CCC(=CC3=O)c3c(C)ccc(Cl)c3F)c3cc-2ccn3)c1