Reaction Details
TargetPlasma kallikrein
LigandBDBM241405
Substrate/CompetitorBDBM241595
Meas. Tech.In Vitro Assay
Temperature298.15±n/a K
Ki 1±n/a nM
Citation Yang, WCorte, JRGilligan, PJPinto, DJEwing, WRDilger, AKWang, YFang, TPabbisetty, KBSmith, II, LM Dihydropyridone p1 as factor XIa inhibitors US Patent US9409908 Publication Date 8/9/2016
 
Plasma kallikrein
Name:Plasma kallikrein
Type:Protein
Mol. Mass.:71391.16
Organism:Homo sapiens (Human)
Description:P03952
Residue:638
BDBM241405
BDBM241595
NameBDBM241405
Synonyms:US9409908, 37 | US9951071, Example 37
TypeSmall organic molecule
Emp. Form.C32H29ClF2N6O3
Mol. Mass.619.061
SMILESC[C@@H]1CCC[C@H](N2CCC(=CC2=O)c2c(F)ccc(Cl)c2F)c2ccnc(c2)-c2ccc(Nc3nnc(C)o3)cc2NC1=O