Reaction Details
TargetPlasma kallikrein
LigandBDBM241447
Substrate/CompetitorBDBM241595
Meas. Tech.In Vitro Assay
Temperature298.15±n/a K
Ki 3±n/a nM
Citation Yang, WCorte, JRGilligan, PJPinto, DJEwing, WRDilger, AKWang, YFang, TPabbisetty, KBSmith, II, LM Dihydropyridone p1 as factor XIa inhibitors US Patent US9409908 Publication Date 8/9/2016
 
Plasma kallikrein
Name:Plasma kallikrein
Type:Protein
Mol. Mass.:71391.16
Organism:Homo sapiens (Human)
Description:P03952
Residue:638
BDBM241447
BDBM241595
NameBDBM241447
Synonyms:US9409908, 79 | US9951071, Example 79
TypeSmall organic molecule
Emp. Form.C31H26ClFN6O4
Mol. Mass.601.027
SMILESCOC(=O)Nc1ccc-2c(NC(=O)[C@H](C)CCC[C@@H](c3cc-2ccn3)n2ncc(cc2=O)-c2c(F)c(Cl)ccc2C#N)c1