Reaction Details
TargetPlasma kallikrein
LigandBDBM241468
Substrate/CompetitorBDBM241595
Meas. Tech.In Vitro Assay
Temperature310.15±n/a K
Ki 4±n/a nM
Citation Yang, WCorte, JRGilligan, PJPinto, DJEwing, WRDilger, AKWang, YFang, TPabbisetty, KBSmith, II, LM Dihydropyridone p1 as factor XIa inhibitors US Patent US9409908 Publication Date 8/9/2016
 
Plasma kallikrein
Name:Plasma kallikrein
Type:Protein
Mol. Mass.:71391.16
Organism:Homo sapiens (Human)
Description:P03952
Residue:638
BDBM241468
BDBM241595
NameBDBM241468
Synonyms:US9409908, 100 | US9951071, Example 100
TypeSmall organic molecule
Emp. Form.C32H31ClFN7O2
Mol. Mass.600.086
SMILESCC(C)[C@@H]1CCC[C@H](N2CCC(=CC2=O)c2c(F)c(Cl)ccc2-n2cnnn2)c2cc(ccn2)-c2ccccc2NC1=O