Reaction Details
TargetPlasma kallikrein
LigandBDBM241503
Substrate/CompetitorBDBM241595
Meas. Tech.In Vitro Assay
Temperature310.15±n/a K
Ki 0.56±n/a nM
Citation Yang, WCorte, JRGilligan, PJPinto, DJEwing, WRDilger, AKWang, YFang, TPabbisetty, KBSmith, II, LM Dihydropyridone p1 as factor XIa inhibitors US Patent US9409908 Publication Date 8/9/2016
 
Plasma kallikrein
Name:Plasma kallikrein
Type:Protein
Mol. Mass.:71391.16
Organism:Homo sapiens (Human)
Description:P03952
Residue:638
BDBM241503
BDBM241595
NameBDBM241503
Synonyms:US9409908, 135 | US9951071, Example 135
TypeSmall organic molecule
Emp. Form.C29H27Cl2F2N5O4
Mol. Mass.618.459
SMILESCOC(=O)Nc1ccc2-c3nc([nH]c3Cl)[C@H](CCC[C@@H](C)C(=O)Nc2c1)N1CCC(=CC1=O)c1c(F)ccc(Cl)c1F