Reaction Details
TargetPlasma kallikrein
LigandBDBM241518
Substrate/CompetitorBDBM241595
Meas. Tech.In Vitro Assay
Temperature310.15±n/a K
Ki 2.27±n/a nM
Citation Yang, WCorte, JRGilligan, PJPinto, DJEwing, WRDilger, AKWang, YFang, TPabbisetty, KBSmith, II, LM Dihydropyridone p1 as factor XIa inhibitors US Patent US9409908 Publication Date 8/9/2016
 
Plasma kallikrein
Name:Plasma kallikrein
Type:Protein
Mol. Mass.:71391.16
Organism:Homo sapiens (Human)
Description:P03952
Residue:638
BDBM241518
BDBM241595
NameBDBM241518
Synonyms:US9409908, 150 | US9951071, Example 150
TypeSmall organic molecule
Emp. Form.C30H25ClF2N4O2
Mol. Mass.546.995
SMILESC[C@@H]1CCC[C@H](N2CCC(=CC2=O)c2c(F)c(Cl)ccc2C#N)c2cc(ccn2)-c2cc(F)ccc2NC1=O