Reaction Details
TargetPlasma kallikrein
LigandBDBM241528
Substrate/CompetitorBDBM241595
Meas. Tech.In Vitro Assay
Temperature310.15±n/a K
Ki 2±n/a nM
Citation Yang, WCorte, JRGilligan, PJPinto, DJEwing, WRDilger, AKWang, YFang, TPabbisetty, KBSmith, II, LM Dihydropyridone p1 as factor XIa inhibitors US Patent US9409908 Publication Date 8/9/2016
 
Plasma kallikrein
Name:Plasma kallikrein
Type:Protein
Mol. Mass.:71391.16
Organism:Homo sapiens (Human)
Description:P03952
Residue:638
BDBM241528
BDBM241595
NameBDBM241528
Synonyms:US9409908, 160 | US9951071, Example 160
TypeSmall organic molecule
Emp. Form.C30H30ClF2N5O4
Mol. Mass.598.04
SMILESCOC(=O)Nc1ccc2-c3nc([nH]c3C)[C@H](CCC[C@@H](C)C(=O)Nc2c1)N1CCC(=CC1=O)c1c(F)ccc(Cl)c1F