Reaction Details
TargetIsoform 1 of Misshapen-like kinase 1 (MINK-delta)
LigandBDBM5447
Substrate/Competitorn/a
Meas. Tech.Kinase Assay
pH7.5±n/a
Temperature303.15±n/a K
IC50 15000±n/a nM
Commentsextracted
Citation Burnet, MWThaher, BAEhlert, JKubbutat, MSchaechtele, CTotzke, F Kinase modulators for the treatment of cancer US Patent US9416123 Publication Date 8/16/2016
 
Isoform 1 of Misshapen-like kinase 1 (MINK-delta)
Name:Isoform 1 of Misshapen-like kinase 1 (MINK-delta)
Type:Protein
Mol. Mass.:145818.42
Organism:Homo sapiens (Human)
Description:Q8N4C8-2
Residue:1295
BDBM5447
NameBDBM5447
Synonyms:CHEMBL939 Iressa N-(3-chloro-4-fluorophenyl)-7-methoxy-6-[3-(morpholin-4-yl)propoxy]quinazolin-4-amine US10507209, Compound Gefitinib US9730934, Gefitinib WO2022090481, Example gefitinib cid_123631
TypeSmall organic molecule
Emp. Form.C22H24ClFN4O3
Mol. Mass.446.902
SMILESCOc1cc2ncnc(Nc3ccc(F)c(Cl)c3)c2cc1OCCCN1CCOCC1