Reaction Details
TargetInterstitial collagenase [100-268]
LigandBDBM7459
Substrate/Competitorn/a
Meas. Tech.cd-MMP-1 Activity Assay
pH7.5±n/a
IC50 3.03e+3±n/a nM
Commentsextracted
Citation Lu, WZhu, JZou, SLi, XHuang, J The efficient expression of human fibroblast collagenase in Escherichia coli and the discovery of flavonoid inhibitors. J Enzyme Inhib Med Chem28:741-6 (2013) 
 
Interstitial collagenase [100-268]
Name:Interstitial collagenase [100-268]
Type:Enzyme
Mol. Mass.:18886.85
Organism:Homo sapiens (Human)
Description:Catalytic domain of human MMP-1 (100-268 aa)
Residue:169
BDBM7459
NameBDBM7459
Synonyms:2-(3,4-dihydroxyphenyl)-5,7-dihydroxy-4H-chromen-4-one CHEMBL151 Luteolin (4) cid_5280445 med.21724, Compound 3
TypeSmall organic molecule
Emp. Form.C15H10O6
Mol. Mass.286.2363
SMILESOc1cc(O)c2c(c1)oc(cc2=O)-c1ccc(O)c(O)c1