Reaction Details
TargetGlutathione peroxidase 1
LigandBDBM50422689
Substrate/Competitorn/a
Meas. Tech.Glutathione Peroxidase Activity Assay
pH7±n/a
Ki 32700±n/a nM
IC50 44300±n/a nM
Commentsextracted
Citation Ekinci, DCankaya, MGül, Ä°Coban, TA Susceptibility of cord blood antioxidant enzymes glutathione reductase, glutathione peroxidase and glutathione S-transferase to different antibiotics: in vitro approach. J Enzyme Inhib Med Chem28:824-9 (2013) 
 
Glutathione peroxidase 1
Name:Glutathione peroxidase 1
Type:Enzyme
Mol. Mass.:21937.89
Organism:Homo sapiens (Human)
Description:P07203
Residue:202
BDBM50422689
NameBDBM50422689
Synonyms:640/359 | CEFUROXIME
TypeSmall organic molecule
Emp. Form.C16H16N4O8S
Mol. Mass.424.385
SMILESCO\N=C(/C(=O)N[C@H]1[C@H]2SCC(COC(N)=O)=C(N2C1=O)C(O)=O)c1ccco1