Reaction Details
TargetP2X purinoceptor 7
LigandBDBM242040
Substrate/Competitorn/a
Meas. Tech.Fluorescent Imaging Plate Reader (FLIPR) Assay
pH7.4±n/a
Temperature310.15±n/a K
IC50 0.6±n/a nM
Commentsextracted
Citation Kilburn, JPRasmussen, LKJessing, MEldemenky, EMChen, BJiang, Y Cyclic amines US Patent US9415055 Publication Date 8/16/2016
 
P2X purinoceptor 7
Name:P2X purinoceptor 7
Type:Protein
Mol. Mass.:68602.85
Organism:Homo sapiens (Human)
Description:Q99572
Residue:595
BDBM242040
NameBDBM242040
Synonyms:US9415055, 2,3-dichloro-N-[2-(4,4-difluoro-1-piperidyl)-2-(4-methoxyphenyl)ethyl]benzamide | US9593105, 41
TypeSmall organic molecule
Emp. Form.C21H22Cl2F2N2O2
Mol. Mass.443.314
SMILESCOc1ccc(cc1)C(CNC(=O)c1cccc(Cl)c1Cl)N1CCC(F)(F)CC1