Reaction Details
TargetBeta-secretase 1
LigandBDBM242224
Substrate/Competitorn/a
Meas. Tech.HTRF FRET Assay
pH5±n/a
Temperature303.15±n/a K
Ki 1.7±n/a nM
Commentsextracted
Citation Gilbert, EJCumming, JNStamford, AWYu, YScott, JDIserloh, UWang, LCaldwell, JP Tricyclic substituted thiadiazine dioxide compounds as BACE inhibitors, compositions and their use US Patent US9416129 Publication Date 8/16/2016
 
Beta-secretase 1
Name:Beta-secretase 1
Type:Protein
Mol. Mass.:55755.10
Organism:Homo sapiens (Human)
Description:P56817
Residue:501
BDBM242224
NameBDBM242224
Synonyms:US9416129, 2
TypeSmall organic molecule
Emp. Form.C17H16FN5O3S2
Mol. Mass.421.469
SMILESCN1C(=N)N[C@@](C)(CS1(=O)=O)c1sc(cc1F)-c1cccc(c1)-c1nnco1