Reaction Details
TargetBeta-secretase 1
LigandBDBM242254
Substrate/Competitorn/a
Meas. Tech.HTRF FRET Assay
pH5±n/a
Temperature303.15±n/a K
Ki 1.1±n/a nM
Commentsextracted
Citation Gilbert, EJCumming, JNStamford, AWYu, YScott, JDIserloh, UWang, LCaldwell, JP Tricyclic substituted thiadiazine dioxide compounds as BACE inhibitors, compositions and their use US Patent US9416129 Publication Date 8/16/2016
 
Beta-secretase 1
Name:Beta-secretase 1
Type:Protein
Mol. Mass.:55755.10
Organism:Homo sapiens (Human)
Description:P56817
Residue:501
BDBM242254
NameBDBM242254
Synonyms:US9416129, 32
TypeSmall organic molecule
Emp. Form.C17H15F2N5O3S2
Mol. Mass.439.46
SMILESCN1C(=N)N[C@@](C)(CS1(=O)=O)c1sc(cc1F)-c1cc(ccc1F)-c1nnco1