Reaction Details
TargetBeta-secretase 2
LigandBDBM242270
Substrate/Competitorn/a
Meas. Tech.HTRF FRET Assay
pH5±n/a
Temperature303.15±n/a K
Ki 0.63±n/a nM
Commentsextracted
Citation Gilbert, EJCumming, JNStamford, AWYu, YScott, JDIserloh, UWang, LCaldwell, JP Tricyclic substituted thiadiazine dioxide compounds as BACE inhibitors, compositions and their use US Patent US9416129 Publication Date 8/16/2016
 
Beta-secretase 2
Name:Beta-secretase 2
Type:Protein
Mol. Mass.:56171.20
Organism:Homo sapiens (Human)
Description:Q9Y5Z0
Residue:518
BDBM242270
NameBDBM242270
Synonyms:US9416129, 48
TypeSmall organic molecule
Emp. Form.C17H16FN5O3S2
Mol. Mass.421.469
SMILESCN1C(=N)N[C@@](C)(CS1(=O)=O)c1sc(cc1F)-c1cccc(c1)-c1ncno1