Reaction Details
TargetEgl nine homolog 1
LigandBDBM242526
Substrate/Competitorn/a
Meas. Tech.Fluorescence Polarization Assay
pH7.5±n/a
IC50 19±n/a nM
Commentsextracted
Citation Takayama, TShibata, TShiozawa, FKawabe, KShimizu, YHamada, MHiratate, ATakahashi, MUshiyama, FOi, TShirasaki, YMatsuda, DKoizumi, CKato, S Partially saturated nitrogen-containing heterocyclic compound US Patent US9422240 Publication Date 8/23/2016
 
Egl nine homolog 1
Name:Egl nine homolog 1
Type:Protein
Mol. Mass.:46035.59
Organism:Homo sapiens (Human)
Description:Q9GZT9
Residue:426
BDBM242526
NameBDBM242526
Synonyms:US9422240, 1-4
TypeSmall organic molecule
Emp. Form.C20H17ClN3O6
Mol. Mass.430.819
SMILESOC1=C(C(=O)NCC([O-])=O)C(=O)N(Cc2ccc(Oc3ccc(Cl)cc3)nc2)CC1