Reaction Details
TargetBeta-secretase 2
LigandBDBM242925
Substrate/Competitorn/a
Meas. Tech.Time-Resolved Endpoint Proteolysis Assay
pH5±n/a
Temperature303.15±n/a K
Ki 10±n/a nM
Commentsextracted
Citation Khan, TAScott, JDCumming, JN S-imino-S-oxo-iminothiazine compounds as BACE inhibitors, compositions, and their use US Patent US9422255 Publication Date 8/23/2016
 
Beta-secretase 2
Name:Beta-secretase 2
Type:Protein
Mol. Mass.:56171.20
Organism:Homo sapiens (Human)
Description:Q9Y5Z0
Residue:518
BDBM242925
NameBDBM242925
Synonyms:US9422255, 5a
TypeSmall organic molecule
Emp. Form.C17H27FN4O3S
Mol. Mass.386.485
SMILESCN[S@]1(O)C[C@](C)(NC(=N)C1(C)C)c1cc(NC(=O)COC)ccc1F