Reaction Details
TargetBeta-secretase 2
LigandBDBM242932
Substrate/Competitorn/a
Meas. Tech.Time-Resolved Endpoint Proteolysis Assay
pH5±n/a
Temperature303.15±n/a K
Ki 3±n/a nM
Commentsextracted
Citation Khan, TAScott, JDCumming, JN S-imino-S-oxo-iminothiazine compounds as BACE inhibitors, compositions, and their use US Patent US9422255 Publication Date 8/23/2016
 
Beta-secretase 2
Name:Beta-secretase 2
Type:Protein
Mol. Mass.:56171.20
Organism:Homo sapiens (Human)
Description:Q9Y5Z0
Residue:518
BDBM242932
NameBDBM242932
Synonyms:US9422255, 9b
TypeSmall organic molecule
Emp. Form.C23H29ClFN5O2S
Mol. Mass.494.025
SMILESCC1(C)C(=N)N[C@@](C)(C[S@@]1(O)NCC1CC1)c1cc(NC(=O)c2ccc(Cl)cn2)ccc1F