Reaction Details
TargetSerum paraoxonase/arylesterase 1
LigandBDBM243042
Substrate/Competitorn/a
Meas. Tech.Enzyme Activity Assay
IC50 1.212e+6±n/a nM
Citation Akbaba, YTürkes, CPolat, LSöyüt, HSahin, EMenzek, AGöksu, SBeydemir, S Synthesis and paroxonase activities of novel bromophenols. J Enzyme Inhib Med Chem28:1073-9 (2013) 
 
Serum paraoxonase/arylesterase 1
Name:Serum paraoxonase/arylesterase 1
Type:Enzyme
Mol. Mass.:39719.73
Organism:Homo sapiens (Human)
Description:P27169
Residue:355
BDBM243042
NameBDBM243042
Synonyms:(2,3-dimethoxyphenyl)(3,4-dimethoxyphenyl)methanone (6)
TypeSmall organic molecule
Emp. Form.C17H18O5
Mol. Mass.302.3218
SMILESCOc1ccc(cc1OC)C(=O)c1cccc(OC)c1OC