Reaction Details
TargetTyrosine-protein phosphatase non-receptor type 1
LigandBDBM243053
Substrate/Competitorn/a
Meas. Tech.Enzymatic Assay
pH6.5±0
Temperature303.15±0 K
IC50 4.18e+3± 9.4e+2 nM
Citation Sun, LPMa, WPGao, LXYang, LLQuan, YCLi, JPiao, HR Synthesis and characterization of 5,7-dihydroxyflavanone derivatives as novel protein tyrosine phosphatase 1B inhibitors. J Enzyme Inhib Med Chem28:1199-204 (2013) 
 
Tyrosine-protein phosphatase non-receptor type 1
Name:Tyrosine-protein phosphatase non-receptor type 1
Type:Protein phosphatase
Mol. Mass.:49963.76
Organism:Homo sapiens (Human)
Description:Human recombinant GST-fusion PTP1B (1-435).
Residue:435
BDBM243053
NameBDBM243053
Synonyms:PTP inhibitor, 4e
TypeSmall organic molecule
Emp. Form.C15H11ClO4
Mol. Mass.290.698
SMILESOc1cc(O)c2C(=O)CC(Oc2c1)c1cccc(Cl)c1