Reaction Details
TargetTyrosine-protein phosphatase non-receptor type 1
LigandBDBM243057
Substrate/Competitorn/a
Meas. Tech.Enzymatic Assay
pH6.5±0
Temperature303.15±0 K
IC50 7.33e+3± 1.25e+3 nM
Citation Sun, LPMa, WPGao, LXYang, LLQuan, YCLi, JPiao, HR Synthesis and characterization of 5,7-dihydroxyflavanone derivatives as novel protein tyrosine phosphatase 1B inhibitors. J Enzyme Inhib Med Chem28:1199-204 (2013) 
 
Tyrosine-protein phosphatase non-receptor type 1
Name:Tyrosine-protein phosphatase non-receptor type 1
Type:Protein phosphatase
Mol. Mass.:49963.76
Organism:Homo sapiens (Human)
Description:Human recombinant GST-fusion PTP1B (1-435).
Residue:435
BDBM243057
NameBDBM243057
Synonyms:PTP inhibitor, 4i
TypeSmall organic molecule
Emp. Form.C15H11BrO4
Mol. Mass.335.149
SMILESOc1cc(O)c2C(=O)CC(Oc2c1)c1cccc(Br)c1