Reaction Details
TargetTyrosine-protein phosphatase non-receptor type 1
LigandBDBM243062
Substrate/Competitorn/a
Meas. Tech.Enzymatic Assay
pH6.5±0
Temperature303.15±0 K
IC50 1.312e+4± 1.25e+3 nM
Citation Sun, LPMa, WPGao, LXYang, LLQuan, YCLi, JPiao, HR Synthesis and characterization of 5,7-dihydroxyflavanone derivatives as novel protein tyrosine phosphatase 1B inhibitors. J Enzyme Inhib Med Chem28:1199-204 (2013) 
 
Tyrosine-protein phosphatase non-receptor type 1
Name:Tyrosine-protein phosphatase non-receptor type 1
Type:Protein phosphatase
Mol. Mass.:49963.76
Organism:Homo sapiens (Human)
Description:Human recombinant GST-fusion PTP1B (1-435).
Residue:435
BDBM243062
NameBDBM243062
Synonyms:PTP inhibitor, 4n
TypeSmall organic molecule
Emp. Form.C16H14O5
Mol. Mass.286.2794
SMILESCOc1ccc(cc1)C1CC(=O)c2c(O)cc(O)cc2O1