Reaction Details
TargetAlpha-glucosidase MAL12
LigandBDBM243068
Substrate/Competitorn/a
Meas. Tech.α-glucosidase Inhibitory Activity Assay
pH7±n/a
Temperature298.15±n/a K
IC50 2.46e+4± 3e+2 nM
Commentsextracted
Citation Kashima, YYamaki, HSuzuki, TMiyazawa, M Structure-activity relationships of bergenin derivatives effect on a-glucosidase inhibition. J Enzyme Inhib Med Chem28:1162-70 (2013) 
 
Alpha-glucosidase MAL12
Name:Alpha-glucosidase MAL12
Type:Protein
Mol. Mass.:68084.32
Organism:Saccharomyces cerevisiae
Description:P53341
Residue:584
BDBM243068
NameBDBM243068
Synonyms:11-O-(3',4'-dimethoxybenzoyl)-bergenin (6)
TypeSmall organic molecule
Emp. Form.C23H24O12
Mol. Mass.492.4295
SMILESCOc1ccc(cc1OC)C(=O)OC[C@H]1OC2C(OC(=O)c3cc(O)c(OC)c(O)c23)[C@@H](O)[C@@H]1O