Reaction Details
TargetAlpha-glucosidase MAL12
LigandBDBM243072
Substrate/Competitorn/a
Meas. Tech.α-glucosidase Inhibitory Activity Assay
pH7±n/a
Temperature298.15±n/a K
IC50>3.00e+5±n/a nM
Commentsextracted
Citation Kashima, YYamaki, HSuzuki, TMiyazawa, M Structure-activity relationships of bergenin derivatives effect on a-glucosidase inhibition. J Enzyme Inhib Med Chem28:1162-70 (2013) 
 
Alpha-glucosidase MAL12
Name:Alpha-glucosidase MAL12
Type:Protein
Mol. Mass.:68084.32
Organism:Saccharomyces cerevisiae
Description:P53341
Residue:584
BDBM243072
NameBDBM243072
Synonyms:Anisic acid
TypeSmall organic molecule
Emp. Form.C8H8O3
Mol. Mass.152.1473
SMILESCOc1ccc(cc1)C(O)=O