Reaction Details
TargetLysosomal alpha-glucosidase
LigandBDBM243075
Substrate/Competitorn/a
Meas. Tech.Inhibition Assay
pH7±n/a
Ki 2.5e+3±n/a nM
Commentsextracted
Citation Yousefi, RAlavian-Mehr, MMMokhtari, FPanahi, FMehraban, MHKhalafi-Nezhad, A Pyrimidine-fused heterocycle derivatives as a novel class of inhibitors for a-glucosidase. J Enzyme Inhib Med Chem28:1228-35 (2013) 
 
Lysosomal alpha-glucosidase
Name:Lysosomal alpha-glucosidase
Type:Enzyme
Mol. Mass.:106235.32
Organism:Mus musculus (Mouse)
Description:P70699
Residue:953
BDBM243075
NameBDBM243075
Synonyms:α-Gl inhibitor, C3
TypeSmall organic molecule
Emp. Form.C26H26N6O11S
Mol. Mass.630.583
SMILESNc1ccc(cc1)S(=O)(=O)c1ccc(cc1)N1c2[nH]c(=O)[nH]c(=O)c2C(C(O)C(O)C(O)C(O)CO)c2c1[nH]c(=O)[nH]c2=O