Reaction Details
TargetAlpha-glucosidase MAL12
LigandBDBM243074
Substrate/Competitorp-Nitrophenyl-α-D-glucopyranoside (pNPG)
Meas. Tech.Inhibition Assay
pH7±n/a
Ki 1.30e+5±n/a nM
Commentsextracted
Citation Yousefi, RAlavian-Mehr, MMMokhtari, FPanahi, FMehraban, MHKhalafi-Nezhad, A Pyrimidine-fused heterocycle derivatives as a novel class of inhibitors for a-glucosidase. J Enzyme Inhib Med Chem28:1228-35 (2013) 
 
Alpha-glucosidase MAL12
Name:Alpha-glucosidase MAL12
Type:Protein
Mol. Mass.:68084.32
Organism:Saccharomyces cerevisiae
Description:P53341
Residue:584
BDBM243074
p-Nitrophenyl-α-D-glucopyranoside (pNPG)
NameBDBM243074
Synonyms:α-Gl inhibitor, C2
TypeSmall organic molecule
Emp. Form.C20H20BrN5O9
Mol. Mass.554.305
SMILESOCC(O)C(O)C(O)C(O)C1c2c([nH]c(=O)[nH]c2=O)N(c2ccc(Br)cc2)c2[nH]c(=O)[nH]c(=O)c12