Reaction Details
TargetGenome polyprotein [2420-3010,M2833T]
LigandBDBM243456
Substrate/Competitorn/a
Meas. Tech.Surface Plasmon Resonance (SPR)-Based Assay
pH7.4±n/a
Temperature298.15±n/a K
Kd 5.9±n/a nM
KOFF 1.50E-04 s-1
KON 2.60E+04 M-1s-1
Commentsextracted
Citation Vendeville, SMRaboisson, PJLin, TTahri, AAmssoms, KI Macrocyclic indole derivatives useful as hepatitis C virus inhibitors US Patent US9427440 Publication Date 8/30/2016
 
Genome polyprotein [2420-3010,M2833T]
Name:Genome polyprotein [2420-3010,M2833T]
Type:Enzyme
Mol. Mass.:65736.12
Organism:Hepatitis C virus genotype 1b (strain HC-J4) (HCV)
Description:M414T
Residue:591
BDBM243456
NameBDBM243456
Synonyms:US9427440, 1
TypeSmall organic molecule
Emp. Form.C32H38N4O6S
Mol. Mass.606.732
SMILESCOc1ccc2-c3c(C4CCCCC4)c4ccc5cc4n3CC(=Cc2c1)C(=O)N(C)CCOCCN(C)S(=O)(=O)NC5=O