Reaction Details
TargetAtypical chemokine receptor 3
LigandBDBM243778
Substrate/Competitorn/a
Meas. Tech.In Vitro Assay
Temperature310.15±n/a K
EC50 0.8±n/a nM
Commentsextracted
Citation Fretz, HGude, MGuerry, PKimmerlin, TLehembre, FPfeifer, TValdenaire, A 1-[m-carboxamido(hetero)aryl-methyl]-heterocyclyl-carboxamide derivatives US Patent US9428456 Publication Date 8/30/2016
 
Atypical chemokine receptor 3
Name:Atypical chemokine receptor 3
Type:Enzyme
Mol. Mass.:41498.84
Organism:Homo sapiens (Human)
Description:P25106
Residue:362
BDBM243778
NameBDBM243778
Synonyms:US9428456, 1.207
TypeSmall organic molecule
Emp. Form.C24H29FN4O2
Mol. Mass.424.5111
SMILESFc1ccc(nc1)C(=O)Nc1cccc(CN2CCC(CC2)C(=O)NC2CCCC2)c1