Reaction Details
TargetAtypical chemokine receptor 3
LigandBDBM243781
Substrate/Competitorn/a
Meas. Tech.In Vitro Assay
Temperature310.15±n/a K
EC50 0.6±n/a nM
Commentsextracted
Citation Fretz, HGude, MGuerry, PKimmerlin, TLehembre, FPfeifer, TValdenaire, A 1-[m-carboxamido(hetero)aryl-methyl]-heterocyclyl-carboxamide derivatives US Patent US9428456 Publication Date 8/30/2016
 
Atypical chemokine receptor 3
Name:Atypical chemokine receptor 3
Type:Enzyme
Mol. Mass.:41498.84
Organism:Homo sapiens (Human)
Description:P25106
Residue:362
BDBM243781
NameBDBM243781
Synonyms:US9428456, 1.210
TypeSmall organic molecule
Emp. Form.C25H29F3N4O2
Mol. Mass.474.5186
SMILESFC(F)(F)c1ccc(nc1)C(=O)Nc1cccc(CN2CCC(CC2)C(=O)NC2CCCC2)c1