Reaction Details
TargetAtypical chemokine receptor 3
LigandBDBM243792
Substrate/Competitorn/a
Meas. Tech.In Vitro Assay
Temperature310.15±n/a K
EC50 1±n/a nM
Commentsextracted
Citation Fretz, HGude, MGuerry, PKimmerlin, TLehembre, FPfeifer, TValdenaire, A 1-[m-carboxamido(hetero)aryl-methyl]-heterocyclyl-carboxamide derivatives US Patent US9428456 Publication Date 8/30/2016
 
Atypical chemokine receptor 3
Name:Atypical chemokine receptor 3
Type:Enzyme
Mol. Mass.:41498.84
Organism:Homo sapiens (Human)
Description:P25106
Residue:362
BDBM243792
NameBDBM243792
Synonyms:US9428456, 1.221
TypeSmall organic molecule
Emp. Form.C28H31ClN4O2
Mol. Mass.491.024
SMILESClc1ccc(NC(=O)c2ccc3ncccc3c2)cc1CN1CCC(CC1)C(=O)NC1CCCC1