Reaction Details
TargetAtypical chemokine receptor 3
LigandBDBM243974
Substrate/Competitorn/a
Meas. Tech.In Vitro Assay
Temperature310.15±n/a K
EC50 0.6±n/a nM
Commentsextracted
Citation Fretz, HGude, MGuerry, PKimmerlin, TLehembre, FPfeifer, TValdenaire, A 1-[m-carboxamido(hetero)aryl-methyl]-heterocyclyl-carboxamide derivatives US Patent US9428456 Publication Date 8/30/2016
 
Atypical chemokine receptor 3
Name:Atypical chemokine receptor 3
Type:Enzyme
Mol. Mass.:41498.84
Organism:Homo sapiens (Human)
Description:P25106
Residue:362
BDBM243974
NameBDBM243974
Synonyms:US9428456, 4.020
TypeSmall organic molecule
Emp. Form.C23H29FN4O2
Mol. Mass.412.5004
SMILESCC(C)(C)NC(=O)C1CCN(Cc2cccc(NC(=O)c3ccc(F)cn3)c2)CC1