Reaction Details
TargetBeta-secretase 2
LigandBDBM244046
Substrate/Competitorn/a
Meas. Tech.HTRF FRET Assay
pH5±n/a
Temperature303.15±n/a K
Ki 1±n/a nM
Commentsextracted
Citation Khan, TAScott, JDCumming, JN S-imino-S-oxo-iminothiadiazine compounds as BACE inhibitors, compositions, and their use US Patent US9428476 Publication Date 8/30/2016
 
Beta-secretase 2
Name:Beta-secretase 2
Type:Protein
Mol. Mass.:56171.20
Organism:Homo sapiens (Human)
Description:Q9Y5Z0
Residue:518
BDBM244046
NameBDBM244046
Synonyms:US9428476, 1b
TypeSmall organic molecule
Emp. Form.C18H22ClFN6O2S
Mol. Mass.440.923
SMILESCN[S@]1(O)C[C@](C)(NC(=N)N1C)c1cc(NC(=O)c2ccc(Cl)cn2)ccc1F