Reaction Details
TargetCytochrome b-245 heavy chain
LigandBDBM244057
Substrate/Competitorn/a
Meas. Tech.Activity Assay
IC50 500000000±n/a nM
Citation Ganesh, TSun, ASmith, SMLambeth, JD Piperazine derivatives, compositions, and uses related thereto US Patent US9428478 Publication Date 8/30/2016
 
Cytochrome b-245 heavy chain
Name:Cytochrome b-245 heavy chain
Type:Enzyme
Mol. Mass.:65355.82
Organism:Homo sapiens (Human)
Description:P04839
Residue:570
BDBM244057
NameBDBM244057
Synonyms:US9428478, TG6-153
TypeSmall organic molecule
Emp. Form.C22H27N3O3
Mol. Mass.381.4681
SMILESCCOc1ccc(cc1)N1CCN(CC1)C(=O)CNc1ccc(cc1)C(C)=O