Reaction Details
TargetCytochrome b-245 heavy chain
LigandBDBM244058
Substrate/Competitorn/a
Meas. Tech.Activity Assay
IC50 600000000±n/a nM
Citation Ganesh, TSun, ASmith, SMLambeth, JD Piperazine derivatives, compositions, and uses related thereto US Patent US9428478 Publication Date 8/30/2016
 
Cytochrome b-245 heavy chain
Name:Cytochrome b-245 heavy chain
Type:Enzyme
Mol. Mass.:65355.82
Organism:Homo sapiens (Human)
Description:P04839
Residue:570
BDBM244058
NameBDBM244058
Synonyms:US9428478, TG6-158
TypeSmall organic molecule
Emp. Form.C19H21F2N3O2
Mol. Mass.361.3857
SMILESCOc1ccc(cc1)N1CCN(CC1)C(=O)CNc1ccc(F)c(F)c1