Reaction Details
TargetCytochrome b-245 heavy chain
LigandBDBM244060
Substrate/Competitorn/a
Meas. Tech.Activity Assay
IC50 1000000000±n/a nM
Citation Ganesh, TSun, ASmith, SMLambeth, JD Piperazine derivatives, compositions, and uses related thereto US Patent US9428478 Publication Date 8/30/2016
 
Cytochrome b-245 heavy chain
Name:Cytochrome b-245 heavy chain
Type:Enzyme
Mol. Mass.:65355.82
Organism:Homo sapiens (Human)
Description:P04839
Residue:570
BDBM244060
NameBDBM244060
Synonyms:US9428478, TG6-143-2
TypeSmall organic molecule
Emp. Form.C35H45N5O4
Mol. Mass.599.7629
SMILESCOc1ccc(cc1)N1CCN(CC1)C(=O)CN(CC(=O)N1CCN(CC1)c1ccc(OC)cc1)c1ccc(cc1)C(C)C