Reaction Details
TargetCytochrome b-245 heavy chain
LigandBDBM244063
Substrate/Competitorn/a
Meas. Tech.Activity Assay
IC50 4500000000±n/a nM
Citation Ganesh, TSun, ASmith, SMLambeth, JD Piperazine derivatives, compositions, and uses related thereto US Patent US9428478 Publication Date 8/30/2016
 
Cytochrome b-245 heavy chain
Name:Cytochrome b-245 heavy chain
Type:Enzyme
Mol. Mass.:65355.82
Organism:Homo sapiens (Human)
Description:P04839
Residue:570
BDBM244063
NameBDBM244063
Synonyms:US9428478, TG6-169
TypeSmall organic molecule
Emp. Form.C19H22FN3O2
Mol. Mass.343.3953
SMILESCOc1ccc(cc1)N1CCN(CC1)C(=O)CNc1ccccc1F