Reaction Details
TargetCytochrome b-245 heavy chain
LigandBDBM244080
Substrate/Competitorn/a
Meas. Tech.Activity Assay
IC50 500000000±n/a nM
Citation Ganesh, TSun, ASmith, SMLambeth, JD Piperazine derivatives, compositions, and uses related thereto US Patent US9428478 Publication Date 8/30/2016
 
Cytochrome b-245 heavy chain
Name:Cytochrome b-245 heavy chain
Type:Enzyme
Mol. Mass.:65355.82
Organism:Homo sapiens (Human)
Description:P04839
Residue:570
BDBM244080
NameBDBM244080
Synonyms:US9428478, TG6-225
TypeSmall organic molecule
Emp. Form.C20H21N3O2
Mol. Mass.335.3996
SMILESCOc1ccc(cc1)N1CCN(CC1)C(=O)c1cc2ccccc2[nH]1