Reaction Details
TargetCytochrome b-245 heavy chain
LigandBDBM244091
Substrate/Competitorn/a
Meas. Tech.Activity Assay
IC50 1000000000±n/a nM
Citation Ganesh, TSun, ASmith, SMLambeth, JD Piperazine derivatives, compositions, and uses related thereto US Patent US9428478 Publication Date 8/30/2016
 
Cytochrome b-245 heavy chain
Name:Cytochrome b-245 heavy chain
Type:Enzyme
Mol. Mass.:65355.82
Organism:Homo sapiens (Human)
Description:P04839
Residue:570
BDBM244091
NameBDBM244091
Synonyms:US9428478, TG6-251-2
TypeSmall organic molecule
Emp. Form.C24H27N3O3
Mol. Mass.405.4895
SMILESCC(C)Oc1ccc(cc1)N1CCN(CC1)C(=O)c1cc2cc(ccc2[nH]1)C(C)=O