Reaction Details
TargetIsoform PDE10A2 of cAMP and cAMP-inhibited cGMP 3',5'-cyclic phosphodiesterase 10A (PDE10A2)
LigandBDBM244127
Substrate/Competitorn/a
Meas. Tech.Fluorescence Polarization Assay
pH7.2±n/a
Temperature298.15±n/a K
Ki 0.17±n/a nM
Commentsextracted
Citation Kuduk, SDCox, CDDudkin, VYMcVean, CAReger, TSSteen, JT Secondary alcohol substituted triazoles as PDE10 inhibitors US Patent US9428492 Publication Date 8/30/2016
 
Isoform PDE10A2 of cAMP and cAMP-inhibited cGMP 3',5'-cyclic phosphodiesterase 10A (PDE10A2)
Name:Isoform PDE10A2 of cAMP and cAMP-inhibited cGMP 3',5'-cyclic phosphodiesterase 10A (PDE10A2)
Type:Enzyme
Mol. Mass.:89387.03
Organism:Homo sapiens (Human)
Description:Q9Y233-2
Residue:789
BDBM244127
NameBDBM244127
Synonyms:US9428492, 6 US9428492, 6b
TypeSmall organic molecule
Emp. Form.C23H26N8O
Mol. Mass.430.5055
SMILESCc1nc(C(O)C2CC2)n(n1)-c1cc(nc(C)n1)N1CC(C1)c1nc2ccccc2n1C