Reaction Details
TargetALK tyrosine kinase receptor
LigandBDBM245218
Substrate/Competitorn/a
Meas. Tech.ELISA-Based In Vitro Kinase Assay
pH7.5±n/a
Temperature303.15±n/a K
IC50 110±n/a nM
Commentsextracted
Citation Gambacorti-Passerini, CMologni, LScapozza, LBisson, WAhmed, SGoekjian, PTardy, SOrsato, AGueyrard, DBenoit, J Alpha-carbolines for the treatment of cancer US Patent US9428500 Publication Date 8/30/2016
 
ALK tyrosine kinase receptor
Name:ALK tyrosine kinase receptor
Type:Protein
Mol. Mass.:176453.10
Organism:Homo sapiens (Human)
Description:Q9UM73
Residue:1620
BDBM245218
NameBDBM245218
Synonyms:US9428500, 12
TypeSmall organic molecule
Emp. Form.C36H33ClN4O
Mol. Mass.573.126
SMILESCN1CCN(CC1)c1ccc(cc1)-c1ccc2[nH]c3nccc(-c4ccc(COc5ccc(Cl)c(C)c5)cc4)c3c2c1