Reaction Details
TargetALK tyrosine kinase receptor [L1196M]
LigandBDBM245217
Substrate/Competitorn/a
Meas. Tech.ELISA-Based In Vitro Kinase Assay
pH7.5±n/a
Temperature303.15±n/a K
IC50 160±n/a nM
Commentsextracted
Citation Gambacorti-Passerini, CMologni, LScapozza, LBisson, WAhmed, SGoekjian, PTardy, SOrsato, AGueyrard, DBenoit, J Alpha-carbolines for the treatment of cancer US Patent US9428500 Publication Date 8/30/2016
 
ALK tyrosine kinase receptor [L1196M]
Name:ALK tyrosine kinase receptor [L1196M]
Type:n/a
Mol. Mass.:176471.13
Organism:Homo sapiens (Human)
Description:Q9UM73[L1196M]
Residue:1620
BDBM245217
NameBDBM245217
Synonyms:US9428500, 11
TypeSmall organic molecule
Emp. Form.C31H27F3N4
Mol. Mass.512.5681
SMILESCN1CCN(CC1)c1ccc(cc1)-c1ccc2[nH]c3nccc(\C=C\c4ccccc4C(F)(F)F)c3c2c1