Reaction Details
TargetALK tyrosine kinase receptor [L1196M]
LigandBDBM245264
Substrate/Competitorn/a
Meas. Tech.ELISA-Based In Vitro Kinase Assay
pH7.5±n/a
Temperature303.15±n/a K
IC50 32±n/a nM
Commentsextracted
Citation Gambacorti-Passerini, CMologni, LScapozza, LBisson, WAhmed, SGoekjian, PTardy, SOrsato, AGueyrard, DBenoit, J Alpha-carbolines for the treatment of cancer US Patent US9428500 Publication Date 8/30/2016
 
ALK tyrosine kinase receptor [L1196M]
Name:ALK tyrosine kinase receptor [L1196M]
Type:n/a
Mol. Mass.:176471.13
Organism:Homo sapiens (Human)
Description:Q9UM73[L1196M]
Residue:1620
BDBM245264
NameBDBM245264
Synonyms:US9428500, 58
TypeSmall organic molecule
Emp. Form.C34H37N5
Mol. Mass.515.6911
SMILESCN1CCN(CC1)c1ccc(cc1)-c1ccc2[nH]c3nccc(N4CCC(Cc5ccccc5)CC4)c3c2c1