Reaction Details
TargetSerine protease 1
LigandBDBM294039
Substrate/Competitorn/a
Meas. Tech.Human Trypsin Assay
pH8.2±n/a
Ki>20000±n/a nM
Commentsextracted
Citation Chen, SDing, ZGong, GYan, XHuang, WGuo, FDuan, BGao, RZhou, PLu, XDong, G Preparation method for benzoxazoleoxazine ketone compound and intermediate and crystal form thereof US Patent US10106557 Publication Date 10/23/2018
 
Serine protease 1
Name:Serine protease 1
Type:Enzyme
Mol. Mass.:26557.80
Organism:Homo sapiens (Human)
Description:P07477
Residue:247
BDBM294039
NameBDBM294039
Synonyms:Process 1 | US10106557, Compound 1
TypeSmall organic molecule
Emp. Form.C18H18N2O5
Mol. Mass.342.3459
SMILESOc1cc(ccc1NC(=O)OCc1ccccc1)N1CCOCC1=O