Reaction Details
TargetSerine protease 1
LigandBDBM50024354
Substrate/Competitorn/a
Meas. Tech.Human Trypsin Assay
pH8.2±n/a
Ki>20000±n/a nM
Commentsextracted
Citation Chen, SDing, ZGong, GYan, XHuang, WGuo, FDuan, BGao, RZhou, PLu, XDong, G Preparation method for benzoxazoleoxazine ketone compound and intermediate and crystal form thereof US Patent US10106557 Publication Date 10/23/2018
 
Serine protease 1
Name:Serine protease 1
Type:Enzyme
Mol. Mass.:26557.80
Organism:Homo sapiens (Human)
Description:P07477
Residue:247
BDBM50024354
NameBDBM50024354
Synonyms:CHEMBL3330444 | US10106557, Compound 2
TypeSmall organic molecule
Emp. Form.C21H20ClN3O5S
Mol. Mass.461.919
SMILES[H][C@@]12COc3cc(ccc3N1C(=O)O[C@H]2CNC(=O)c1ccc(Cl)s1)N1CCCCC1=O