Reaction Details
TargetSerine protease 1
LigandBDBM294042
Substrate/Competitorn/a
Meas. Tech.Human Trypsin Assay
pH8.2±n/a
Ki>20000±n/a nM
Commentsextracted
Citation Chen, SDing, ZGong, GYan, XHuang, WGuo, FDuan, BGao, RZhou, PLu, XDong, G Preparation method for benzoxazoleoxazine ketone compound and intermediate and crystal form thereof US Patent US10106557 Publication Date 10/23/2018
 
Serine protease 1
Name:Serine protease 1
Type:Enzyme
Mol. Mass.:26557.80
Organism:Homo sapiens (Human)
Description:P07477
Residue:247
BDBM294042
NameBDBM294042
Synonyms:US10106557, Compound 8
TypeSmall organic molecule
Emp. Form.C21H16ClN3O5S
Mol. Mass.457.887
SMILESClc1ccc(s1)C(=O)NC[C@@H]1OC(=O)N2[C@H]1COc1cc(ccc21)-n1ccccc1=O