Reaction Details
TargetCoagulation factor X
LigandBDBM294044
Substrate/Competitorn/a
Meas. Tech.Human Coagulation Factor Xa Assay
pH8.3±n/a
Ki 106±n/a nM
Commentsextracted
Citation Chen, SDing, ZGong, GYan, XHuang, WGuo, FDuan, BGao, RZhou, PLu, XDong, G Preparation method for benzoxazoleoxazine ketone compound and intermediate and crystal form thereof US Patent US10106557 Publication Date 10/23/2018
 
Coagulation factor X
Name:Coagulation factor X
Type:Enzyme
Mol. Mass.:54726.60
Organism:Homo sapiens (Human)
Description:n/a
Residue:488
BDBM294044
NameBDBM294044
Synonyms:US10106557, Compound 34
TypeSmall organic molecule
Emp. Form.C18H14ClN5O4S
Mol. Mass.431.853
SMILESClc1ccc(s1)C(=O)NC[C@@H]1OC(=O)N2[C@H]1COc1cc(ccc21)-n1cncn1