Reaction Details
TargetP2Y purinoceptor 1
LigandBDBM245296
Substrate/Competitorn/a
Meas. Tech.Binding Assay
Temperature298.15±n/a K
Ki 3.7±n/a nM
Commentsextracted
Citation Thibeault, CClark, CGDeLucca, IHu, CHJeon, YLam, PYQiao, JXYang, WWang, YWang, TC 7-hydroxy-spiropipiperidine indolinyl antagonists of P2Y1 receptor US Patent US9428504 Publication Date 8/30/2016
 
P2Y purinoceptor 1
Name:P2Y purinoceptor 1
Type:Enzyme
Mol. Mass.:42090.25
Organism:Homo sapiens (Human)
Description:P47900
Residue:373
BDBM245296
NameBDBM245296
Synonyms:US9428504, 34
TypeSmall organic molecule
Emp. Form.C32H36FN5O2S
Mol. Mass.573.724
SMILESCc1ccc2nc(NC(=O)Nc3ccccc3N3CC4(CCN(CC(C)(C)C)CC4)c4c3c(O)ccc4F)sc2c1