Reaction Details
TargetP2Y purinoceptor 1
LigandBDBM245316
Substrate/Competitorn/a
Meas. Tech.Scintillation Proximity Assay (SPA)
pH7.4±n/a
Temperature298.15±n/a K
Ki 6.4±n/a nM
Commentsextracted
Citation Thibeault, CClark, CGDeLucca, IHu, CHJeon, YLam, PYQiao, JXYang, WWang, YWang, TC 7-hydroxy-spiropipiperidine indolinyl antagonists of P2Y1 receptor US Patent US9428504 Publication Date 8/30/2016
 
P2Y purinoceptor 1
Name:P2Y purinoceptor 1
Type:Enzyme
Mol. Mass.:42090.25
Organism:Homo sapiens (Human)
Description:P47900
Residue:373
BDBM245316
NameBDBM245316
Synonyms:US9428504, 56
TypeSmall organic molecule
Emp. Form.C31H36ClFN4O2
Mol. Mass.551.095
SMILESCc1ccc(NC(=O)Nc2ccccc2N2CC3(CCN(CC(C)(C)C)CC3)c3c2c(O)ccc3Cl)cc1F