Reaction Details
TargetP2Y purinoceptor 1
LigandBDBM245341
Substrate/Competitorn/a
Meas. Tech.Scintillation Proximity Assay (SPA)
pH7.4±n/a
Temperature298.15±n/a K
Ki 3.5±n/a nM
Commentsextracted
Citation Thibeault, CClark, CGDeLucca, IHu, CHJeon, YLam, PYQiao, JXYang, WWang, YWang, TC 7-hydroxy-spiropipiperidine indolinyl antagonists of P2Y1 receptor US Patent US9428504 Publication Date 8/30/2016
 
P2Y purinoceptor 1
Name:P2Y purinoceptor 1
Type:Enzyme
Mol. Mass.:42090.25
Organism:Homo sapiens (Human)
Description:P47900
Residue:373
BDBM245341
NameBDBM245341
Synonyms:US9428504, 90
TypeSmall organic molecule
Emp. Form.C38H53N5O4S
Mol. Mass.675.924
SMILESCCN(CC)S(=O)(=O)c1ccc(O)c2N(CC3(CCN(CC(C)(C)C)CC3)c12)c1ccccc1NC(=O)Nc1ccc(cc1)C(C)(C)C